{"text_format":"1","workbook":"xlsx","n_sheets":5,"sheets":["Sheet4","Sheet1","Dashboard","Sheet3","Sheet2"],"not_rendered":{"charts":5,"images":0,"macros":0,"external_links":0,"defined_names":0,"comments":1,"pivot_tables":0},"unopened":[],"bounds":{"document_bytes":16777216,"sheet_cells":100000,"rows_first":2000,"rows_last":500,"rows_between":2000,"halvings":0,"cell_chars":16384,"cell_head_chars":4096},"cells_cut":0,"cells_raw":0,"read":"whole","date_system":"1900"}

{"sheet":"Sheet4","index":0,"n_rows":75,"n_cols":18,"rows_kept":75,"cut":false,"hidden":true,"merged":[]}
["COUNTY","Indicator 1 - Percent of infants and toddlers with Individual Family Service Plans (IFSP) who receive the early intervention services on their IFSPs in a timely manner. ","Indicator 2 - Percent of infants and toddlers with IFSPs who primarily receive early intervention services in the home or programs for typically developing children.   ","Indicator 3 Outcome 1 Summary  Statement 1        Of the children who entered the program below age expectations in each outcome, the percent who substantially increased their rate of growth by the time they exited B-3","Indicator 3 Outcome 1 Summary Statement 2            The percent of children who were functioning within age expectations in each Outcome by the time they exited the program","Indicator 3  Outcome 2 Summary  Statement 1        Of the children who entered the program below age expectations in each Outcome, the percent who substantially increased their rate of growth by the time they exited B-3","Indicator 3  Outcome 2  Summary Statement 2       The percent of children who were functioning within age expectations in each Outcome by the time they exited the program","Indicator 3  Outcome 3   Summary Statement 1         Of the children who entered the program below age expectations in each outcome, the percent who substantially increased their rate of growth by the time they exited B-3","Indicator 3            Outcome 3          Summary          Statement 2                 The percent of children who were functioning within age expectations in each Outcome by the time they exited the program","Indicator 4A - Percent of families reporting early intervention services have helped the family know their rights.  ","Indicator 4B - Percent of families reporting early intervention services have helped the family effectively communicate their child's needs.","Indicator 4C - Percent of families reporting early intervention services have helped the family help their child develop and learn.","Indicator 5- Percent of infants and toddlers birth to 1 with IFSPs.","Indicator 6 - Percent of infants and toddlers birth to 3 with IFSPs. ","Indicator 7- Percent of eligible infants and toddlers with IFSPs for whom an evaluation and assessment and  initial IFSP meeting were conducted in a timely manner. ","Indicator 8A - Percent of all children exiting Part C who received timely transition planning to support the child's transition to preschool and other appropriate community services by their third birthday including: IFSPs with transition steps and services. ","Indicator 8B - Percent of all children exiting Part C who received timely transition planning to support the child's transition to preschool and other appropriate community services by their third birthday including: Notification to LEA, if child potentially eligible for Part B.","Indicator 8C - Percent of all children exiting Part C who received timely transition planning to support the child's transition to preschool and other appropriate community services by their third birthday including transition planning conference, if child potentially eligible for Part B.                              "]
["State Target",1,0.96340000000000003,0.59030000000000005,0.6613,0.6613,0.50729999999999997,0.69530000000000003,0.68530000000000002,0.82879999999999998,0.87539999999999996,0.85250000000000004,0.95,2.8299999999999999E-2,1,1,1,1]
["Overall State Result",{"$f":"AVERAGE(B4:B74)","v":0.99899672258685013},0.99170000000000003,0.54375212802179096,0.52178193453113464,0.61208791208791213,0.38567560915579618,0.64156718702173243,0.53753384198867826,0.86370000000000002,0.93489999999999995,0.91569999999999996,1.03E-2,2.8500000000000001E-2,0.99419999999999997,0.99780000000000002,0.98709999999999998,0.99019999999999997]
["Adams County",1,1,0.75,0.72222222222222221,0.6875,0.61111111111111116,0.83333333333333337,0.94444444444444442,1,1,1,2.2727272727272728E-2,6.8126520681265207E-2,0.97368421052631582,1,1,0.94444444444444398]
["Ashland County",1,1,0.5,0.8,0.75,0.6,1,0.6,0,0,0,1.0752688172043012E-2,1.098901098901099E-2,0.91666666666666663,1,1,0.75]
["Barron County",1,1,0.2,0.54285714285714282,0.5357142857142857,0.48571428571428571,0.34782608695652173,0.51428571428571423,0.94289999999999996,0.98209999999999997,0.97019999999999995,8.130081300813009E-3,2.7166882276843468E-2,1,1,1,1]
["Bayfield County",1,1,0.75,0.5714285714285714,0.7142857142857143,0.2857142857142857,0.42857142857142855,0.2857142857142857,0,0,0,0,1.4367816091954023E-2,0.5,1,1,0.75]
["Brown County",1,0.99173553719008267,0.60509554140127386,0.41477272727272729,0.66666666666666663,0.33522727272727271,0.61764705882352944,0.38068181818181818,0.7,0.95289999999999997,0.89410000000000001,1.0109763142692086E-2,2.3669796557120502E-2,1,1,1,1]
["Buffalo County",1,1,0.4,0.55555555555555558,0.5,0.44444444444444442,0.6,0.66666666666666663,0.95,1,1,8.0645161290322578E-3,3.4313725490196081E-2,1,1,1,1]
["Burnett County",0.96875,1,0.5,0.5,0.8,0.3,0.5714285714285714,0.6,0.91669999999999996,0.97219999999999995,0.93059999999999998,5.1724137931034482E-2,5.8201058201058198E-2,1,1,1,1]
["Calumet County",1,1,0.20833333333333334,0.44117647058823528,0.43333333333333335,0.23529411764705882,0.57894736842105265,0.61764705882352944,0.94,0.83330000000000004,0.91659999999999997,9.6711798839458421E-3,3.0797101449275364E-2,1,1,1,1]
["Chippewa County",1,1,0.13333333333333333,0.69767441860465118,0.25714285714285712,0.34883720930232559,0.4,0.79069767441860461,0.9,0.91569999999999996,0.90359999999999996,1.0101010101010102E-2,3.2000000000000001E-2,1,1,1,1]
["Clark County",1,1,0.5,0.46666666666666667,0.82758620689655171,0.26666666666666666,0.58333333333333337,0.33333333333333331,0.94289999999999996,0.9345,0.9345,3.5971223021582736E-3,2.4235429890363532E-2,1,1,1,1]
["Columbia County",1,1,0.66666666666666663,0.5,0.55000000000000004,0.22727272727272727,0.83333333333333337,0.68181818181818177,0.98570000000000002,0.99399999999999999,1,1.639344262295082E-3,1.7457719585379158E-2,1,1,1,1]
["Crawford County",1,1,0.5,0.35714285714285715,0.5,0.14285714285714285,0.66666666666666663,0.6428571428571429,1,1,0.95830000000000004,5.7803468208092483E-3,4.7131147540983603E-2,1,1,1,1]
["Dane County",0.99376947040498442,1,0.40697674418604651,0.51417004048582993,0.55263157894736847,0.41700404858299595,0.54326923076923073,0.48582995951417002,0.8,0.85409999999999997,0.84050000000000002,7.659167065581618E-3,2.1687139906511579E-2,1,0.99698795180722899,0.99462365591397905,0.99378881987577605]
["Dodge County",1,1,0.48076923076923078,0.49382716049382713,0.58823529411764708,0.39506172839506171,0.59649122807017541,0.54320987654320985,0.89,0.91579999999999995,0.85419999999999996,1.2925969447708578E-2,3.7138389366692726E-2,0.98130841121495327,0.98850574712643702,0.939393939393939,0.9375]
["Door County",1,1,0.66666666666666663,0.76470588235294112,0.6,0.47058823529411764,0.90909090909090906,0.76470588235294112,0.99,0.9778,0.9778,4.7169811320754715E-3,3.5313001605136438E-2,1,1,1,1]
["Douglas County",1,1,0.5,0.48275862068965519,0.68965517241379315,0.17241379310344829,0.63636363636363635,0.55172413793103448,0.81879999999999997,0.83850000000000002,0.80730000000000002,1.7199017199017199E-2,2.8115501519756839E-2,1,0.96969696969696995,0.96,0.95833333333333304]
["Dunn County",1,0.95918367346938771,0.47619047619047616,0.5757575757575758,0.75,0.45454545454545453,0.77777777777777779,0.72727272727272729,0.8,0.96260000000000001,0.92589999999999995,1.7167381974248927E-2,3.5714285714285712E-2,1,1,1,1]
["Eau Claire County",1,1,0.58823529411764708,0.45121951219512196,0.67567567567567566,0.40243902439024393,0.78260869565217395,0.6097560975609756,0.93,0.99309999999999998,0.97919999999999996,8.2987551867219917E-3,3.4413535990823058E-2,1,1,1,1]
["Florence County",1,1,0,0,0,0,0,0,0,0,0,0,1.1363636363636364E-2,"0.00 %",1,1,1]
["Fond du Lac County",1,1,0.54716981132075471,0.44615384615384618,0.49090909090909091,0.38461538461538464,0.66666666666666663,0.47692307692307695,0.84,0.83330000000000004,0.83330000000000004,1.1288805268109126E-2,3.0864197530864196E-2,1,1,0.98507462686567204,0.98387096774193605]
["Forest County",1,1,0.5,0.6,0.33333333333333331,0.6,0.6,0.6,1,0.95830000000000004,1,0,2.2922636103151862E-2,1,1,1,1]
["Grant County",1,1,0.72727272727272729,0.78947368421052633,0.6,0.57894736842105265,0.75,0.78947368421052633,0.86,0.85,0.88329999999999997,9.5419847328244278E-3,1.5103838892385148E-2,1,1,0.93333333333333302,0.93333333333333302]
["Green County",1,1,0.38461538461538464,0.66666666666666663,0.65,0.66666666666666663,0.6470588235294118,0.7407407407407407,0.91669999999999996,0.93059999999999998,0.91669999999999996,0,3.3927056827820185E-2,1,1,0.94117647058823495,1]
["Green Lake County",1,1,0.22222222222222221,0.1111111111111111,0.125,0.22222222222222221,0.125,0.22222222222222221,0.96,1,1,0,2.9126213592233011E-2,1,1,1,1]
["Iowa County",1,1,0.16666666666666666,0.54545454545454541,0.6,0.45454545454545453,0.66666666666666663,0.63636363636363635,0.97870000000000001,1,1,3.8910505836575876E-3,1.5056461731493099E-2,1,1,1,1]
["Iron County",1,1,0,0,0,0,0,0,1,1,1,2.5000000000000001E-2,1.680672268907563E-2,1,"0.00","0.00",0]
["Jackson County",1,1,0.4,0.2,0.6,0.6,0.8,0.6,1,0.99170000000000003,0.98329999999999995,4.0816326530612249E-3,1.532033426183844E-2,1,1,1,1]
{"$rows_left_out":46}
{"sheet":"Sheet1","index":1,"n_rows":75,"n_cols":19,"rows_kept":75,"cut":false,"hidden":true,"merged":[]}
["COUNTY","Indicator 1 - Percent of infants and toddlers with Individual Family Service Plans (IFSP) who receive the early intervention services on their IFSPs in a timely manner. ","Indicator 2 - Percent of infants and toddlers with IFSPs who primarily receive early intervention services in the home or programs for typically developing children.   ","Indicator 3 Outcome 1 Summary  Statement 1        Of the children who entered the program below age expectations in each outcome, the percent who substantially increased their rate of growth by the time they exited B-3","Indicator 3 Outcome 1 Summary Statement 2            The percent of children who were functioning within age expectations in each Outcome by the time they exited the program","Indicator 3  Outcome 2 Summary  Statement 1        Of the children who entered the program below age expectations in each Outcome, the percent who substantially increased their rate of growth by the time they exited B-3","Indicator 3  Outcome 2  Summary Statement 2       The percent of children who were functioning within age expectations in each Outcome by the time they exited the program","Indicator 3  Outcome 3   Summary Statement 1         Of the children who entered the program below age expectations in each outcome, the percent who substantially increased their rate of growth by the time they exited B-3","Indicator 3            Outcome 3          Summary          Statement 2                 The percent of children who were functioning within age expectations in each Outcome by the time they exited the program","Indicator 4A - Percent of families reporting early intervention services have helped the family know their rights.  ","Indicator 4B - Percent of families reporting early intervention services have helped the family effectively communicate their child's needs.","Indicator 4C - Percent of families reporting early intervention services have helped the family help their child develop and learn.","Indicator 5- Percent of infants and toddlers birth to 1 with IFSPs.","Indicator 6 - Percent of infants and toddlers birth to 3 with IFSPs. ","Indicator 7- Percent of eligible infants and toddlers with IFSPs for whom an evaluation and assessment and  initial IFSP meeting were conducted in a timely manner. ","Indicator 8A - Percent of all children exiting Part C who received timely transition planning to support the child's transition to preschool and other appropriate community services by their third birthday including: IFSPs with transition steps and services. ","Indicator 8B - Percent of all children exiting Part C who received timely transition planning to support the child's transition to preschool and other appropriate community services by their third birthday including: Notification to LEA, if child potentially eligible for Part B.","Indicator 8C - Percent of all children exiting Part C who received timely transition planning to support the child's transition to preschool and other appropriate community services by their third birthday including transition planning conference, if child potentially eligible for Part B.                               OCCURRED","Indicator 8C - Percent of all children exiting Part C who received timely transition planning to support the child's transition to preschool and other appropriate community services by their third birthday including transition planning conference, if child potentially eligible for Part B. TIMELY"]
["State Target",1,0.96330000000000005,0.59019999999999995,0.66120000000000001,0.66120000000000001,0.50719999999999998,0.69520000000000004,0.68520000000000003,0.82850000000000001,0.87509999999999999,0.85219999999999996,9.4999999999999998E-3,2.8199999999999999E-2,1,1,1,1,1]
["Overall State Result",0.99790000000000001,0.98880000000000001,0.50780000000000003,0.55420000000000003,0.60389999999999999,0.41689999999999999,0.62490000000000001,0.58750000000000002,0.83250000000000002,0.87929999999999997,0.85299999999999998,1.0200000000000001E-2,2.8400000000000002E-2,0.99760000000000004,0.99719999999999998,0.9798,0.97640000000000005,0.98609999999999998]
["Adams County",1,1,0.86699999999999999,0.58799999999999997,0.82399999999999995,0.52900000000000003,0.86799999999999999,0.76500000000000001,0.5,0.5,0.5,1.3899999999999999E-2,5.5599999999999997E-2,0.93100000000000005,1,1,1,1]
["Ashland County",1,1,0.57099999999999995,0.5,0.83299999999999996,0.5,1,0.625,1,1,1,1.6400000000000001E-2,2.0500000000000001E-2,1,0.75,0.75,1,0.5]
["Barron County",0.98080000000000001,0.98040000000000005,0.25,0.54500000000000004,0.5,0.48499999999999999,0.61499999999999999,0.63600000000000001,0.8,0.86670000000000003,0.8,9.7999999999999997E-3,3.1899999999999998E-2,1,0.89739999999999998,0.95830000000000004,0.96,1]
["Bayfield County",1,1,0.28599999999999998,0.28599999999999998,0.42899999999999999,0.14299999999999999,0.33300000000000002,0.33300000000000002,0,0,0,8.6999999999999994E-3,2.0500000000000001E-2,1,1,0,0.66669999999999996,1]
["Brown County",1,0.99529999999999996,0.51300000000000001,0.34899999999999998,0.63600000000000001,0.27100000000000002,0.58399999999999996,0.29499999999999998,0.69230000000000003,0.69230000000000003,0.76919999999999999,8.8999999999999999E-3,2.1100000000000001E-2,1,1,0.99229999999999996,0.99170000000000003,1]
["Buffalo County",1,1,0.33300000000000002,0.5,0.16700000000000001,0.25,0.2,0.5,0.75,1,1,1.26E-2,1.7100000000000001E-2,1,1,1,1,1]
["Burnett County",1,0.94740000000000002,0.2,0.5,0.14299999999999999,0.25,0.42899999999999999,0.375,0,0.5,0.5,1.61E-2,4.7500000000000001E-2,1,1,1,1,1]
["Calumet County",1,1,0.42899999999999999,0.79200000000000004,0.5,0.41699999999999998,0.66700000000000004,0.91700000000000004,0.75,0.875,1,1.2999999999999999E-2,2.76E-2,1,1,1,0.92110000000000003,1]
["Chippewa County",0.99439999999999995,1,0.34499999999999997,0.72199999999999998,0.46800000000000003,0.58899999999999997,0.47799999999999998,0.81899999999999995,0.88890000000000002,1,0.94440000000000002,1.1599999999999999E-2,4.1000000000000002E-2,1,1,1,0.98040000000000005,1]
["Clark County",1,1,0.70799999999999996,0.54800000000000004,0.77800000000000002,0.32300000000000001,0.79200000000000004,0.61299999999999999,1,0.92310000000000003,1,1.2E-2,2.6599999999999999E-2,1,1,0.95830000000000004,1,1]
["Columbia County",1,0.92589999999999995,0.35,0.33300000000000002,0.38100000000000001,0.20799999999999999,0.5,0.54200000000000004,0.81820000000000004,0.90910000000000002,1,6.4000000000000003E-3,1.4800000000000001E-2,1,1,0.95450000000000002,1,1]
["Crawford County",1,0.94740000000000002,0.6,0.64300000000000002,0.92300000000000004,0.42899999999999999,0.9,0.78600000000000003,1,1,1,6.3E-3,4.0399999999999998E-2,1,1,1,1,1]
["Dane County",0.99339999999999995,0.99739999999999995,0.44500000000000001,0.54100000000000004,0.56399999999999995,0.40899999999999997,0.61599999999999999,0.56499999999999995,0.75,0.91669999999999996,0.74580000000000002,6.1000000000000004E-3,2.1600000000000001E-2,0.99809999999999999,1,0.995,0.92569999999999997,0.9829]
["Dodge County",1,0.96519999999999995,0.20899999999999999,0.54400000000000004,0.56399999999999995,0.46800000000000003,0.54300000000000004,0.67100000000000004,0.8,0.9,0.85,8.3000000000000001E-3,4.4699999999999997E-2,1,1,1,0.96079999999999999,0.96079999999999999]
["Door County",1,1,0.5,0.66700000000000004,0.45500000000000002,0.53300000000000003,0.66700000000000004,0.66700000000000004,0.875,1,0.875,1.52E-2,3.04E-2,1,1,1,1,1]
["Douglas County",1,1,0.51500000000000001,0.442,0.69,0.25600000000000001,0.73,0.58099999999999996,0.8,0.8,0.8,7.1000000000000004E-3,3.15E-2,0.98109999999999997,0.98150000000000004,0.97560000000000002,1,1]
["Dunn County",1,1,0.316,0.54300000000000004,0.6,0.42899999999999999,0.51900000000000002,0.71399999999999997,0.78569999999999995,0.85709999999999997,0.92859999999999998,4.5999999999999999E-3,2.9100000000000001E-2,1,1,1,0.88890000000000002,1]
["Eau Claire County",1,1,0.47699999999999998,0.38500000000000001,0.57399999999999995,0.34599999999999997,0.69199999999999995,0.55100000000000005,0.81820000000000004,0.95450000000000002,0.95450000000000002,1.37E-2,3.4500000000000003E-2,1,1,1,1,1]
["Florence County",1,1,1,1,1,1,0,0,0,0,0,0,1.18E-2,1,1,1,1,1]
["Fond du Lac County",1,1,0.60499999999999998,0.50800000000000001,0.65300000000000002,0.39,0.67300000000000004,0.54200000000000004,0.86670000000000003,0.73329999999999995,0.93330000000000002,1.52E-2,3.2399999999999998E-2,1,1,1,1,1]
["Forest County",1,1,0.66700000000000004,0.33300000000000002,0.66700000000000004,0.5,0.66700000000000004,0.33300000000000002,0,0,0,0,2.3300000000000001E-2,1,1,1,0.75,1]
["Grant County",1,1,0.5,0.83299999999999996,0.58299999999999996,0.66700000000000004,0.71399999999999997,0.83299999999999996,1,0.75,1,5.7000000000000002E-3,1.37E-2,1,1,1,1,1]
["Green County",1,1,0.625,0.86199999999999999,0.88200000000000001,0.86199999999999999,0.7,0.86199999999999999,1,0.83330000000000004,1,1.9E-2,3.15E-2,1,1,1,1,1]
["Green Lake County",1,0.94440000000000002,0.4,0.375,0.33300000000000002,0.25,0.4,0.625,1,0.75,0.75,1.37E-2,2.8400000000000002E-2,1,1,1,1,1]
["Iowa County",1,1,0.875,0.5,0.625,0.33300000000000002,0.75,0.5,0.5,1,1,1.5699999999999999E-2,1.5699999999999999E-2,1,1,1,1,0.9]
["Iron County",1,1,0,0.5,0.5,0.5,0,0.5,1,1,1,2.5600000000000001E-2,3.3599999999999998E-2,1,1,1,1,1]
["Jackson County",1,1,0,0.14299999999999999,0.33300000000000002,0.28599999999999998,0.5,0.57099999999999995,1,1,1,8.3999999999999995E-3,1.6899999999999998E-2,1,1,1,1,1]
{"$rows_left_out":46}
{"sheet":"Dashboard","index":2,"n_rows":65,"n_cols":31,"rows_kept":65,"cut":false,"hidden":false,"merged":[[0,0,0,3]]}
["Instructions\nStep one: Click on a county name (Adams County (A2) or Ashland County (A25))  \nStep two: Click on the arrow to the right of the cell, a drop down menu will appear then select the County that would you like to observe.\n                                                                                                                                                                                                                              For the description of indicators hover mouse over red tags in the top right corner in cells A3 to A20. If you need further description right click on the desired indicator, select edit comment to read the full description. \n"]
["Adams County","Dashboard APR Data","State Targets","Overall State Results"]
["Indicator 1 ",{"$f":"VLOOKUP($A$2,Sheet4!$A$4:$S$75,2,FALSE)","v":1},1,0.99790000000000001]
["Indicator 2",{"$f":"VLOOKUP($A$2,Sheet4!$A$4:$S$75,3,FALSE)","v":1},0.96330000000000005,0.98880000000000001]
["Indicator 3 O1 SS1",{"$f":"VLOOKUP($A$2,Sheet4!$A$4:$S$75,4,FALSE)","v":0.75},0.59019999999999995,0.50780000000000003]
["Indicator 3 O1 SS2    ",{"$f":"VLOOKUP($A$2,Sheet4!$A$4:$S$75,5,FALSE)","v":0.72222222222222221},0.66120000000000001,0.55420000000000003]
["Indicator 3 O2 SS1   ",{"$f":"VLOOKUP($A$2,Sheet4!$A$4:$S$75,6,FALSE)","v":0.6875},0.66120000000000001,0.60389999999999999]
["Indicator 3 O2 SS2     ",{"$f":"VLOOKUP($A$2,Sheet4!$A$4:$S$75,7,FALSE)","v":0.61111111111111116},0.50719999999999998,0.41689999999999999]
["Indicator 3 O3 SS1    ",{"$f":"VLOOKUP($A$2,Sheet4!$A$4:$S$75,8,FALSE)","v":0.83333333333333337},0.69520000000000004,0.62490000000000001]
["Indicator 3 O3 SS2   ",{"$f":"VLOOKUP($A$2,Sheet4!$A$4:$S$75,9,FALSE)","v":0.94444444444444442},0.68520000000000003,0.58750000000000002]
["Indicator 4A",{"$f":"VLOOKUP($A$2,Sheet4!$A$4:$S$75,10,FALSE)","v":1},0.82850000000000001,0.83250000000000002]
["Indicator 4B",{"$f":"VLOOKUP($A$2,Sheet4!$A$4:$S$75,11,FALSE)","v":1},0.87509999999999999,0.87929999999999997]
["Indicator 4C ",{"$f":"VLOOKUP($A$2,Sheet4!$A$4:$S$75,12,FALSE)","v":1},0.85219999999999996,0.85299999999999998]
["Indicator 5",{"$f":"VLOOKUP($A$2,Sheet4!$A$4:$S$75,13,FALSE)","v":2.2727272727272728E-2},9.4999999999999998E-3,1.0200000000000001E-2]
["Indicator 6",{"$f":"VLOOKUP($A$2,Sheet4!$A$4:$S$75,14,FALSE)","v":6.8126520681265207E-2},2.8199999999999999E-2,2.8400000000000002E-2]
["Indicator 7",{"$f":"VLOOKUP($A$2,Sheet4!$A$4:$S$75,15,FALSE)","v":0.97368421052631582},1,0.99760000000000004]
["Indicator 8A ",{"$f":"VLOOKUP($A$2,Sheet4!$A$4:$S$75,16,FALSE)","v":1},1,0.99719999999999998]
["Indicator 8B ",{"$f":"VLOOKUP($A$2,Sheet4!$A$4:$S$75,17,FALSE)","v":1},1,0.9798]
["Indicator 8C ",{"$f":"VLOOKUP($A$2,Sheet4!$A$4:$S$75,18,FALSE)","v":0.94444444444444398},1,0.97640000000000005]
[]
[]
[]
[]
[]
["Ashland County","Dashboard APR Data","State Targets","Overall State Results"]
["Indicator 1 ",{"$f":"VLOOKUP($A$25,Sheet4!$A$4:$R$75,2,FALSE)","v":1},1,0.99790000000000001]
["Indicator 2",{"$f":"VLOOKUP($A$25,Sheet4!$A$4:$R$75,3,FALSE)","v":1},0.96330000000000005,0.98880000000000001]
["Indicator 3 O1 SS1",{"$f":"VLOOKUP($A$25,Sheet4!$A$4:$R$75,4,FALSE)","v":0.5},0.59019999999999995,0.50780000000000003]
["Indicator 3 O1 SS2    ",{"$f":"VLOOKUP($A$25,Sheet4!$A$4:$R$75,5,FALSE)","v":0.8},0.66120000000000001,0.55420000000000003]
["Indicator 3 O2 SS1   ",{"$f":"VLOOKUP($A$25,Sheet4!$A$4:$R$75,6,FALSE)","v":0.75},0.66120000000000001,0.60389999999999999]
{"$rows_left_out":36}
{"sheet":"Sheet3","index":3,"n_rows":0,"n_cols":0,"rows_kept":0,"cut":false,"hidden":true,"merged":[]}

{"sheet":"Sheet2","index":4,"n_rows":0,"n_cols":0,"rows_kept":0,"cut":false,"hidden":false,"merged":[]}