{"text_format":"1","workbook":"xlsx","n_sheets":9,"sheets":["FQHC Cost Report Overview","Data","Worksheet A","Worksheet B","Worksheet B-1","Worksheet C","Desk Review","Summary & Certification","Dropdown Menus - Hidden"],"not_rendered":{"charts":0,"images":0,"macros":1,"external_links":1,"defined_names":4,"comments":5,"pivot_tables":0},"unopened":[],"bounds":{"document_bytes":16777216,"sheet_cells":100000,"rows_first":2000,"rows_last":500,"rows_between":2000,"halvings":0,"cell_chars":16384,"cell_head_chars":4096},"cells_cut":0,"cells_raw":0,"read":"whole","date_system":"1900"}

{"sheet":"FQHC Cost Report Overview","index":0,"n_rows":61,"n_cols":29,"rows_kept":61,"cut":false,"hidden":false,"merged":[[53,2,53,3],[55,2,55,3],[55,4,55,8],[28,2,28,3],[29,2,29,3],[30,2,30,3],[36,2,36,3],[52,4,52,8],[31,2,31,3],[32,2,32,3],[33,2,33,3],[34,2,34,3],[35,2,35,3],[47,2,47,3],[46,2,46,3],[45,2,45,3],[21,5,21,8],[18,2,18,3],[23,2,23,3],[24,2,24,3],[5,1,5,8],[6,1,6,8],[7,1,7,8],[23,5,23,8],[24,5,24,8],[12,1,12,8],[16,1,16,8],[22,5,22,8],[17,5,17,8],[18,5,18,8],[19,5,19,8],[20,5,20,8],[44,2,44,3],[43,2,43,3],[38,2,38,3],[25,2,25,3],[26,2,26,3],[27,2,27,3],[39,2,39,3],[40,2,40,3],[60,1,60,8],[61,1,61,8],[37,2,37,3],[41,2,41,3],[42,2,42,3],[58,4,58,8],[54,4,54,8],[53,4,53,8],[57,2,57,3],[58,2,58,3],[51,1,51,8],[52,2,52,3],[57,4,57,8],[56,4,56,8],[56,2,56,3],[54,2,54,3],[25,5,25,8],[26,5,26,8],[27,5,27,8],[32,5,32,8],[33,5,33,8],[31,5,31,8],[28,5,28,8],[29,5,29,8],[30,5,30,8],[34,5,34,8],[35,5,35,8],[36,5,36,8],[37,5,37,8],[38,5,38,8],[39,5,39,8],[40,5,40,8],[41,5,41,8],[47,5,47,8],[42,5,42,8],[43,5,43,8],[44,5,44,8],[45,5,45,8],[46,5,46,8],[17,2,17,3],[22,2,22,3],[21,2,21,3],[20,2,20,3],[19,2,19,3]]}
[null,"DEPARTMENT OF HEALTH SERVICES",null,null,null,null,null,null,"STATE OF WISCONSIN"]
[null,"Division of Medicaid Services",null,null,null,null,null,null,"Administrative Code: WI SPA 17-0010"]
[null,"F-02656 (01/2021)"]
[]
[]
[]
[null,"Federally Qualified Health Center Cost Report"]
[null,{"$f":"SUBSTITUTE(\"Annual FY 2016 Medicaid Cost Report \",2016,(YEAR(D15)))","v":"Annual FY 1900 Medicaid Cost Report "}]
[]
[null,null,null,null,null,null,null,null,{"$f":"IF('FQHC Cost Report Overview'!B15=\"Please Select\",\"\",'FQHC Cost Report Overview'!B15)","v":""}]
{"$rows_left_out":52}
{"sheet":"Data","index":1,"n_rows":88,"n_cols":11,"rows_kept":88,"cut":false,"hidden":true,"merged":[]}
[{"$f":"'FQHC Cost Report Overview'!$B$15","v":"Please Select"},{"$f":"'FQHC Cost Report Overview'!B15","v":"Please Select"}]
[{"$f":"'FQHC Cost Report Overview'!$B$15","v":"Please Select"}]
[{"$f":"'FQHC Cost Report Overview'!$B$15","v":"Please Select"},"Compensation","Fringe Benefits","Purchased & Contract Services","Direct Service Non-Personnel","Total (Columns C+D+E+F)","Reclassifications","Adjustments","Adjusted Expenses (Columns G+H+I)","Outstationed Enrollment","Net Cost (Column J-K)"]
[{"$f":"'FQHC Cost Report Overview'!$B$15","v":"Please Select"},{"$f":"'Worksheet A'!C44","v":0},{"$f":"'Worksheet A'!D44","v":0},{"$f":"'Worksheet A'!E44","v":0},{"$f":"'Worksheet A'!F44","v":0},{"$f":"'Worksheet A'!G44","v":0},{"$f":"'Worksheet A'!H44","v":0},{"$f":"'Worksheet A'!I44","v":0},{"$f":"'Worksheet A'!J44","v":0},{"$f":"'Worksheet A'!#REF!","v":{"$error":"#REF!"}},{"$f":"'Worksheet A'!#REF!","v":{"$error":"#REF!"}}]
[{"$f":"'FQHC Cost Report Overview'!$B$15","v":"Please Select"},{"$f":"'Worksheet A'!C45","v":0},{"$f":"'Worksheet A'!D45","v":0},{"$f":"'Worksheet A'!E45","v":0},{"$f":"'Worksheet A'!F45","v":0},{"$f":"'Worksheet A'!G45","v":0},{"$f":"'Worksheet A'!H45","v":0},{"$f":"'Worksheet A'!I45","v":0},{"$f":"'Worksheet A'!J45","v":0},{"$f":"'Worksheet A'!#REF!","v":{"$error":"#REF!"}},{"$f":"'Worksheet A'!#REF!","v":{"$error":"#REF!"}}]
[{"$f":"'FQHC Cost Report Overview'!$B$15","v":"Please Select"},{"$f":"'Worksheet A'!C46","v":0},{"$f":"'Worksheet A'!D46","v":0},{"$f":"'Worksheet A'!E46","v":0},{"$f":"'Worksheet A'!F46","v":0},{"$f":"'Worksheet A'!G46","v":0},{"$f":"'Worksheet A'!H46","v":0},{"$f":"'Worksheet A'!I46","v":0},{"$f":"'Worksheet A'!J46","v":0},{"$f":"'Worksheet A'!#REF!","v":{"$error":"#REF!"}},{"$f":"'Worksheet A'!#REF!","v":{"$error":"#REF!"}}]
[{"$f":"'FQHC Cost Report Overview'!$B$15","v":"Please Select"}]
[{"$f":"'FQHC Cost Report Overview'!$B$15","v":"Please Select"},"Compensation","Fringe Benefits","Purchased & Contract Services","Indirect Service Non-Personnel","Total (Columns C+D+E+F)","Reclassifications","Adjustments","Adjusted Expenses (Columns G+H+I)","Outstationed Enrollment","Net Cost (Column J-K)"]
[{"$f":"'FQHC Cost Report Overview'!$B$15","v":"Please Select"},{"$f":"'Worksheet A'!C83","v":0},{"$f":"'Worksheet A'!D83","v":0},{"$f":"'Worksheet A'!E83","v":0},{"$f":"'Worksheet A'!F83","v":0},{"$f":"'Worksheet A'!G83","v":0},{"$f":"'Worksheet A'!H83","v":0},{"$f":"'Worksheet A'!I83","v":0},{"$f":"'Worksheet A'!J83","v":0},{"$f":"'Worksheet A'!#REF!","v":{"$error":"#REF!"}},{"$f":"'Worksheet A'!#REF!","v":{"$error":"#REF!"}}]
[{"$f":"'FQHC Cost Report Overview'!$B$15","v":"Please Select"}]
{"$rows_left_out":79}
{"sheet":"Worksheet A","index":2,"n_rows":155,"n_cols":33,"rows_kept":155,"cut":false,"hidden":true,"merged":[[124,2,124,4],[152,1,152,6],[153,1,153,6],[5,1,5,10],[6,1,6,10],[7,1,7,10],[134,1,134,3],[135,1,135,3],[127,2,127,4],[126,2,126,4],[125,2,125,4],[132,1,132,3],[133,1,133,3],[131,1,131,10],[11,1,11,10],[50,1,50,10],[86,1,86,10],[123,2,123,4],[122,2,122,4],[121,2,121,4],[120,2,120,4],[105,1,105,10],[136,1,136,3],[137,1,137,3],[138,1,138,3],[154,1,154,6],[139,1,139,3],[146,1,146,10],[147,1,147,6],[148,1,148,6],[149,1,149,6],[144,1,144,3],[150,1,150,6],[151,1,151,6]]}
[null,"DEPARTMENT OF HEALTH SERVICES",null,null,null,null,null,null,null,null,"STATE OF WISCONSIN"]
[null,"Division of Medicaid Services",null,null,null,null,null,null,null,null,"Administrative Code: WI SPA 17-0010"]
[null,"F-02656 (01/2021)"]
[]
[null,null,null,null,null,null,null,null,null,null,null,null,null,null,null,null,null,null,null,"DR2"]
[null,null,null,null,null,null,null,null,null,null,null,null,null,null,null,null,null,null,null,"DR3"]
[null,"Federally Qualified Health Center Cost Report",null,null,null,null,null,null,null,null,null,null,null,null,null,null,null,null,null,"DR4"]
[null,{"$f":"'FQHC Cost Report Overview'!B8","v":"Annual FY 1900 Medicaid Cost Report "},null,null,null,null,null,null,null,null,null,null,null,null,null,null,null,null,null,"DR5"]
[null,null,null,null,null,null,null,null,null,null,null,null,null,null,null,null,null,null,null,"DR6"]
[null,null,null,null,null,null,null,null,null,null,{"$f":"IF('FQHC Cost Report Overview'!B15=\"Please Select\",\"\",'FQHC Cost Report Overview'!B15)","v":""},null,null,null,null,null,null,null,null,"DR7"]
{"$rows_left_out":146}
{"sheet":"Worksheet B","index":3,"n_rows":128,"n_cols":23,"rows_kept":128,"cut":false,"hidden":true,"merged":[[5,1,5,10],[6,1,6,10],[7,1,7,10],[15,6,15,9],[15,2,15,5],[91,10,92,10],[12,17,12,18],[11,1,12,10],[90,1,90,10],[91,1,92,1],[14,1,14,10],[15,1,16,1],[53,1,54,1],[52,1,52,10],[15,10,16,10],[53,10,54,10],[91,6,91,9],[91,2,91,5],[53,6,53,9],[53,2,53,5]]}
[null,"DEPARTMENT OF HEALTH SERVICES",null,null,null,null,null,null,null,null,"STATE OF WISCONSIN"]
[null,"Division of Medicaid Services",null,null,null,null,null,null,null,null,"Administrative Code: WI SPA 17-0010"]
[null,"F-02656 (01/2021)"]
[null,null,null,null,null,null,null,null,null,null,null,null,{"$f":"IF(B4=\"Please Select\",\"Hide\",\"\")","v":""}]
[null,null,null,null,null,null,null,null,null,null,null,null,{"$f":"IF(B5=\"Please Select\",\"Hide\",\"\")","v":""}]
[null,null,null,null,null,null,null,null,null,null,null,null,{"$f":"IF(B6=\"Please Select\",\"Hide\",\"\")","v":""},null,null,null,null,null,"DR 10"]
[null,"Federally Qualified Health Center Cost Report",null,null,null,null,null,null,null,null,null,null,{"$f":"IF(B7=\"Please Select\",\"Hide\",\"\")","v":""}]
[null,{"$f":"'FQHC Cost Report Overview'!B8","v":"Annual FY 1900 Medicaid Cost Report "},null,null,null,null,null,null,null,null,null,null,{"$f":"IF(B8=\"Please Select\",\"Hide\",\"\")","v":""}]
[null,null,null,null,null,null,null,null,null,null,null,null,""]
[null,null,null,null,null,null,null,null,null,null,{"$f":"IF('FQHC Cost Report Overview'!B15=\"Please Select\",\"\",'FQHC Cost Report Overview'!B15)","v":""},null,""]
{"$rows_left_out":119}
{"sheet":"Worksheet B-1","index":4,"n_rows":84,"n_cols":20,"rows_kept":84,"cut":false,"hidden":true,"merged":[[7,1,7,10],[6,1,6,10],[5,1,5,10],[55,1,55,3],[55,4,55,6],[55,7,55,9],[54,1,54,3],[53,1,53,3],[47,1,47,4],[11,1,12,10],[52,1,52,10],[15,3,16,3],[15,4,16,4],[14,1,14,10],[15,1,16,1],[15,2,16,2],[77,4,77,6],[77,7,77,9],[58,1,58,3],[57,1,57,3],[75,1,75,3],[76,1,76,3],[58,4,58,6],[59,4,59,6],[60,4,60,6],[66,4,66,6],[67,4,67,6],[67,7,67,9],[69,7,69,9],[65,4,65,6],[65,7,65,9],[68,4,68,6],[61,4,61,6],[54,7,54,9],[57,7,57,9],[58,7,58,9],[59,7,59,9],[60,7,60,9],[57,4,57,6],[61,7,61,9],[77,1,77,3],[71,1,71,3],[66,1,66,3],[64,1,64,3],[63,1,63,3],[67,1,67,3],[65,1,65,3],[74,1,74,3],[61,1,61,3],[69,1,69,3],[72,1,72,3],[62,1,62,3],[73,1,73,3],[70,1,70,3],[68,1,68,3],[62,4,62,6],[64,4,64,6],[63,4,63,6],[66,7,66,9],[69,4,69,6],[68,7,68,9],[62,7,62,9],[63,7,63,9],[64,7,64,9],[15,5,15,7],[15,8,15,10],[60,1,60,3],[56,4,56,6],[56,7,56,9],[56,1,56,3],[53,4,53,6],[53,7,53,9],[54,4,54,6],[59,1,59,3],[76,4,76,6],[76,7,76,9],[73,4,73,6],[73,7,73,9],[74,4,74,6],[74,7,74,9],[75,4,75,6],[75,7,75,9],[71,7,71,9],[72,7,72,9],[70,4,70,6],[71,4,71,6],[72,4,72,6],[70,7,70,9]]}
[null,"DEPARTMENT OF HEALTH SERVICES",null,null,null,null,null,null,null,null,"STATE OF WISCONSIN"]
[null,"Division of Medicaid Services",null,null,null,null,null,null,null,null,"Administrative Code: WI SPA 17-0010"]
[null,"F-02656 (01/2021)"]
[]
[]
[]
[null,"Federally Qualified Health Center Cost Report"]
[null,{"$f":"'FQHC Cost Report Overview'!B8","v":"Annual FY 1900 Medicaid Cost Report "}]
[]
[null,null,null,null,null,null,null,null,null,null,{"$f":"IF('FQHC Cost Report Overview'!B15=\"Please Select\",\"\",'FQHC Cost Report Overview'!B15)","v":""}]
{"$rows_left_out":75}
{"sheet":"Worksheet C","index":5,"n_rows":77,"n_cols":16,"rows_kept":77,"cut":false,"hidden":true,"merged":[[7,1,7,8],[6,1,6,8],[5,1,5,8],[67,5,67,6],[67,7,67,8],[59,5,59,6],[62,3,62,4],[63,3,63,4],[61,7,61,8],[62,7,62,8],[63,7,63,8],[64,7,64,8],[65,7,65,8],[67,1,67,4],[64,1,64,2],[65,3,65,4],[62,5,62,6],[63,5,63,6],[61,5,61,6],[12,1,12,8],[23,7,23,8],[24,7,24,8],[19,1,19,6],[20,1,20,6],[21,1,21,6],[22,1,22,6],[23,1,23,6],[24,1,24,6],[19,7,19,8],[20,7,20,8],[21,7,21,8],[22,7,22,8],[16,1,16,8],[17,1,17,6],[14,7,14,8],[17,7,17,8],[18,1,18,6],[18,7,18,8],[13,7,13,8],[13,1,14,2],[13,3,13,4],[13,5,13,6],[14,3,14,4],[14,5,14,6],[66,1,66,2],[66,3,66,4],[66,5,66,6],[66,7,66,8],[58,7,58,8],[65,1,65,2],[58,1,58,2],[59,1,59,2],[60,1,60,2],[61,1,61,2],[62,1,62,2],[63,1,63,2],[59,7,59,8],[60,7,60,8],[58,3,58,4],[59,3,59,4],[64,5,64,6],[65,5,65,6],[64,3,64,4],[61,3,61,4],[29,1,29,2],[40,1,40,2],[41,1,41,2],[42,1,42,2],[43,1,43,2],[29,3,29,4],[30,3,30,4],[31,3,31,4],[32,3,32,4],[33,3,33,4],[34,3,34,4],[35,3,35,4],[36,3,36,4],[37,3,37,4],[25,7,25,8],[57,3,57,4],[60,3,60,4],[58,5,58,6],[60,5,60,6],[35,1,35,2],[36,1,36,2],[37,1,37,2],[38,1,38,2],[39,1,39,2],[30,1,30,2],[31,1,31,2],[32,1,32,2],[33,1,33,2],[34,1,34,2],[25,1,25,6],[27,1,27,8],[28,1,28,2],[28,3,28,4],[28,5,28,6],[28,7,28,8],[41,3,41,4],[42,3,42,4],[43,3,43,4],[29,5,29,6],[30,5,30,6],[31,5,31,6],[32,5,32,6],[33,5,33,6],[34,5,34,6],[35,5,35,6],[36,5,36,6],[37,5,37,6],[38,5,38,6],[39,5,39,6],[40,5,40,6],[41,5,41,6],[38,3,38,4],[39,3,39,4],[40,3,40,4],[43,7,43,8],[42,5,42,6],[43,5,43,6],[38,7,38,8],[39,7,39,8],[40,7,40,8],[41,7,41,8],[42,7,42,8],[29,7,29,8],[30,7,30,8],[31,7,31,8],[32,7,32,8],[33,7,33,8],[34,7,34,8],[35,7,35,8],[36,7,36,8],[37,7,37,8]]}
[null,"DEPARTMENT OF HEALTH SERVICES",null,null,null,null,null,null,"STATE OF WISCONSIN"]
[null,"Division of Medicaid Services",null,null,null,null,null,null,"Administrative Code: WI SPA 17-0010"]
[null,"F-02656 (01/2021)"]
[]
[]
[]
[null,"Federally Qualified Health Center Cost Report"]
[null,{"$f":"'FQHC Cost Report Overview'!B8","v":"Annual FY 1900 Medicaid Cost Report "}]
[]
[null,null,null,null,null,null,null,null,{"$f":"IF('FQHC Cost Report Overview'!B15=\"Please Select\",\"\",'FQHC Cost Report Overview'!B15)","v":""}]
{"$rows_left_out":68}
{"sheet":"Desk Review","index":6,"n_rows":59,"n_cols":13,"rows_kept":59,"cut":false,"hidden":true,"merged":[[6,1,6,9],[5,1,5,9],[27,6,27,9],[28,4,28,5],[28,6,28,9],[23,6,23,9],[25,6,25,9],[19,6,19,9],[13,6,13,9],[16,6,16,9],[17,6,17,9],[15,6,15,9],[18,6,18,9],[11,1,11,9],[17,4,17,5],[14,6,14,9],[40,6,40,9],[7,1,7,9],[49,4,49,5],[30,6,30,9],[31,4,31,5],[31,6,31,9],[39,4,39,5],[39,6,39,9],[45,6,45,9],[48,6,48,9],[49,6,49,9],[48,4,48,5],[46,6,46,9],[47,6,47,9],[45,4,45,5],[42,1,42,9],[22,6,22,9],[37,6,37,9],[24,6,24,9],[25,4,25,5],[33,4,33,5],[33,6,33,9],[36,4,36,5],[24,4,24,5],[34,6,34,9],[34,4,34,5],[35,6,35,9],[36,6,36,9],[26,6,26,9],[27,4,27,5],[32,6,32,9],[26,4,26,5],[37,4,37,5],[47,4,47,5],[41,6,41,9],[44,1,44,9],[20,4,20,5],[20,6,20,9],[21,4,21,5],[21,6,21,9],[35,4,35,5],[38,6,38,9],[40,4,40,5],[38,4,38,5],[22,4,22,5],[32,4,32,5],[41,4,41,5],[29,6,29,9],[30,4,30,5],[12,4,12,5],[13,4,13,5],[18,4,18,5],[19,4,19,5],[14,4,14,5],[16,4,16,5],[15,4,15,5],[29,4,29,5],[23,4,23,5],[12,6,12,9],[57,4,57,5],[58,4,58,5],[55,4,55,5],[54,6,54,9],[46,4,46,5],[50,6,50,9],[51,6,51,9],[52,6,52,9],[50,4,50,5],[53,4,53,5],[51,4,51,5],[52,4,52,5],[54,4,54,5],[53,6,53,9],[56,4,56,5]]}
[null,"DEPARTMENT OF HEALTH SERVICES",null,null,null,null,null,null,null,"STATE OF WISCONSIN"]
[null,"Division of Medicaid Services",null,null,null,null,null,null,null,"Administrative Code: WI SPA 17-0010"]
[null,"F-02656 (01/2021)"]
[]
[]
[]
[null,"Federally Qualified Health Center Cost Report"]
[null,{"$f":"'FQHC Cost Report Overview'!B8","v":"Annual FY 1900 Medicaid Cost Report "}]
[]
[null,null,null,null,null,null,null,null,null,{"$f":"IF('FQHC Cost Report Overview'!B15=\"Please Select\",\"\",'FQHC Cost Report Overview'!B15)","v":""}]
{"$rows_left_out":50}
{"sheet":"Summary & Certification","index":7,"n_rows":43,"n_cols":13,"rows_kept":43,"cut":false,"hidden":true,"merged":[[7,1,7,3],[6,1,6,3],[5,1,5,3],[40,1,40,3],[28,5,28,7],[29,5,29,6],[26,5,26,6],[30,5,30,6],[11,5,11,7],[25,5,25,6],[24,5,24,6],[23,5,23,6],[22,5,22,6],[21,5,21,6],[20,5,20,6],[19,5,19,6],[42,5,42,6],[34,5,34,6],[33,5,33,6],[32,5,32,6],[31,5,31,6],[36,5,36,11],[41,5,41,6],[40,5,40,6],[39,5,39,6],[37,5,37,6],[37,1,37,3],[12,5,12,6],[11,1,11,3],[15,1,15,3],[26,1,26,3],[30,1,30,3],[18,5,18,6],[17,5,17,6],[16,5,16,6],[14,5,14,6],[13,5,13,6],[15,5,15,6]]}
[null,"DEPARTMENT OF HEALTH SERVICES",null,"STATE OF WISCONSIN"]
[null,"Division of Medicaid Services                             ",null,"Administrative Code: WI SPA 17-0010"]
[null,"F-02656 (01/2021)"]
[]
[]
[]
[null,"Federally Qualified Health Center Cost Report"]
[null,{"$f":"'FQHC Cost Report Overview'!B8","v":"Annual FY 1900 Medicaid Cost Report "}]
[]
[null,null,null,{"$f":"IF('FQHC Cost Report Overview'!B15=\"Please Select\",\"\",'FQHC Cost Report Overview'!B15)","v":""}]
{"$rows_left_out":34}
{"sheet":"Dropdown Menus - Hidden","index":8,"n_rows":53,"n_cols":18,"rows_kept":53,"cut":false,"hidden":true,"merged":[]}
["Please Select","Please Select","Please Select","Please Select","Please Select","Type of Service","Please Select","Please Select","Please Select","Please Select","BLS Data Low w/Benefits","BLS Data High w/Benefits","BLS Data Ranges Low","BLS Data Ranges High",null,"Professional Level","Lower","Upper"]
["Dental","Access","Agency Employee","Abri Health Plan","Alcohol and Other Drug Abuse Counselor","Behavioral Health","Case Management","Community Services ","Behavioral Health Only","Alcohol and Other Drug Abuse Counselor",{"$f":"M2*$I$23","v":36472.759496600003},{"$f":"N2*$I$23","v":109418.2784898},23260,69780,null,"Alcohol and Other Drug Abuse Counselor",36472.759485732204,109418.2784571966]
["Medical","Beloit","Contractor","Americhoice","Anesthesiologists","Medical","Dental Assistant","County Run Community Based Programs","Behavioral Health and Dental","Advanced Practice Nurse Prescriber",{"$f":"M3*$I$23","v":74215.636585300002},222646.90975590001,47330,141990,null,"Advanced Practice Nurse Prescriber",74215.636563185995,222646.90968955786]
["Behavioral Health","Bridge",null,"Anthem BCBS Medicaid","APNP (Behavioral)","Behavioral Health","Dental Hygienist - Not WI Medicaid Certified","Education","Behavioral Health and Medical","Audiologists",62306.324101350001,186918.97230405,39735,119205,null,"Audiologists",62306.324082784602,186918.9722483537]
[null,"Kenosha",null,"Atrium Health Plan","APNP (Medical)","Medical","Genetic Counselor","Environment ","Behavioral Health, Dental and Medical","Certified Nurse-Midwife",57515.9423188,172547.82695640001,36680,110040,null,"Certified Nurse-Midwife",57515.942301661962,172547.82690498588]
[null,"La Clinica",null,"Badger Care ","Audiologists","Medical","Health Education - Enabling Services","Fundraising","Dental Only","Chiropractor",{"$f":"M6*$I$23","v":59766.088917150002},179298.26675144999,38115,114345,null,"Chiropractor",59766.088899341485,179298.26669802447]
[null,"Lake Superior",null,"Beacon Health Strategies","Certified Nurse-Midwife","Medical","Health Educator","Grant Funded - WIC (Women Infant Children)","Dental and Medical","Dentist",159603.60384185001,478810.81152554997,101785,305355,null,"Dentist",159603.6037942929,478810.81138287863]
[null,"Lakeshore",null,"Care Wisconsin ","Chiropractor","Medical","Laboratory - Medical Support","Medical Records/Electronic Medical Records- non-FQHC reimbursable programs and services","Medical Only","Dental Hygienist",50020.680479000002,150062.04143700001,31900,95700,null,"Dental Assistant",28891.255095641267,86673.765286923794]
[null,"Marshfield",null,"Cenpatico ","Dentist","Dental","Medical Assistant","Other Non-Reimbursable",null,"Nurse practitioner",52090.501740200001,156271.5052206,33220,99660,null,"Dental Hygienist",50020.680464095327,150062.04139228599]
[null,"Milwaukee Health System",null,"Children's Community Health  Plan","Dental Hygienist","Dental","Medical Director","Outreach",null,"Obstetrics/Gynecologist",{"$f":"M10*$I$23","v":177024.59945695},{"$f":"N10*$I$23","v":531073.79837085004},112895,338685,null,"Nurse practitioner",52090.501724678586,156271.50517403573]
{"$rows_left_out":43}